*HEADING
 AMS - one element test
*PREPRINT,ECHO=YES,HISTORY=NO,MODEL=NO
*NODE,NSET=QA_TEST
*ELEMENT,TYPE=CPE4, ELSET=EALL
*SOLID SECTION,MATERIAL=A1, ELSET=EALL
*MATERIAL,NAME=A1
*ELASTIC
 1.,.3
*DENSITY
 1.,
*BOUNDARY
 11, ENCASTRE
 12, ENCASTRE
*mpc
link, 13, 14
*nset,nset=nset2
*step
*frequency, eigensolver=ams, residual, nset=nset2
, .1,1.
*output, field
*node output,nset=nset2
u
*nodeprint, nset=nset2
u,
*end step