*HEADING
 PLASTICITY WITH CAP MODEL
*RESTART,TIMEMARKS=NO,WRITE,NUM=20
*NODE,NSET=N01
*NCOPY,OLD SET=N01,CHANGE NUMBER=10,SHIFT,NEW SET=NR1
*NCOPY,OLD SET=N01,CHANGE NUMBER=20,SHIFT,NEW SET=NR1
*NCOPY,OLD SET=N01,CHANGE NUMBER=30,SHIFT,NEW SET=NR1
*NSET,NSET=NR1
 N01,
*NCOPY,OLD SET=NR1,CHANGE NUMBER=40,SHIFT,NEW SET=NR2
*NCOPY,OLD SET=NR2,CHANGE NUMBER=40,SHIFT,NEW SET=NR3
*NCOPY,OLD SET=NR3,CHANGE NUMBER=40,SHIFT,NEW SET=NR4
*NSET,NSET=R1TOP
*NSET,NSET=R2TOP
*NSET,NSET=R3TOP
*NSET,NSET=R1BOT
*NSET,NSET=R2BOT
*NSET,NSET=R3BOT
*NSET,NSET=R4BOT1
*NSET,NSET=R4BOT2
*NSET,NSET=R2LHS,GENERATE
*NSET,NSET=R34LHS,GENERATE
*NSET,NSET=R2RHS,GENERATE
*NSET,NSET=R34RHS,GENERATE
*NSET,NSET=BOTTOM,GENERATE
*NSET,NSET=BACKHT,GENERATE
*NSET,NSET=BACKHC,GENERATE
*NSET,NSET=BACK,GENERATE
*NSET,NSET=FRONHT,GENERATE
*NSET,NSET=FRONHC,GENERATE
*NSET,NSET=FRONT,GENERATE
*ELEMENT,TYPE=C3D8R,ELSET=C3D
*ELEMENT,TYPE=CPE4R,ELSET=CPE
*ELSET,ELSET=EALL,GEN
*ELSET,ELSET=R14,GEN
*ELSET,ELSET=R23,GEN
*SOLID SECTION,MATERIAL=CAP1,ELSET=R14
*SOLID SECTION,MATERIAL=CAP2,ELSET=R23
*MATERIAL,NAME=CAP1
*DENSITY
 0.01,
*ELASTIC
 30000., 0.3
*CAP PLASTICITY
*CAP HARDENING
*MATERIAL,NAME=CAP2
*DENSITY
 0.01,
*ELASTIC
 30000., 0.3
*CAP PLASTICITY
*CAP HARDENING
*BOUNDARY
 R1BOT, 2
 R1TOP, 2
 FRONT, 3
 BACK,  3
*AMPLITUDE,NAME=RAMP
 0.0, 0.0, 1.0, 1.0
*STEP
*DYNAMIC,EXPLICIT
,1.0
*BOUNDARY,TYPE=VEL,AMPLITUDE=RAMP
 R1BOT ,1,,-0.025
 R1TOP ,1,, 0.025
 R2BOT ,2,,-0.01
 R2TOP ,2,, 0.01
 R2LHS ,1,,-0.01
 R2RHS ,1,, 0.01
 FRONHT,3,, 0.01
 BACKHT,3,,-0.01
 R3BOT ,2,, 0.01
 R4BOT1,2,,-0.006
 R4BOT2,2,,-0.011
 R3TOP ,2,,-0.01
 R34LHS,1,, 0.01
 R34RHS,1,,-0.01
 FRONHC,3,,-0.01
 BACKHC,3,, 0.01
**
*FILE OUTPUT,NUMBER INTERVAL=2,TIME MARKS=YES
*EL FILE
 MISES,PRESS,PEEQ,
 LE,PE,
*ELSET, ELSET=QA_TEST_ALLELEMENTS
EALL
*OUTPUT, FIELD, NUMBER INTERVAL=2, TIMEMARKS=YES
*ELEMENT OUTPUT, ELSET=QA_TEST_ALLELEMENTS
 MISES,PRESS,PEEQ,
 LE,PE,
*OUTPUT,HISTORY,TIME INTERVAL=1.0
*ENERGY OUTPUT, VAR=ALL
**
*END STEP