*Heading
Standard-to-Explicit co-simulation with dissimilar meshes.
Standard mesh is coarser than the Explicit mesh.
*Preprint, echo=NO, model=NO, history=NO, contact=NO
**
** PARTS
**
*Part, name=Part-1
*End Part
**
**
** ASSEMBLY
**
*Assembly, name=Assembly
**
*Instance, name=Part-1-1, part=Part-1
*Node
*Element, type=C3D4
*Nset, nset=_PickedSet22, internal, generate
*Elset, elset=_PickedSet22, internal, generate
** Section: Section-1
*Solid Section, elset=_PickedSet22, material=Material-1
*End Instance
**
*Nset, nset=_PickedSet36, internal, instance=Part-1-1
*Elset, elset=_PickedSet36, internal, instance=Part-1-1
*Nset, nset=_PickedSet59, internal, instance=Part-1-1
*Elset, elset=_PickedSet59, internal, instance=Part-1-1
*Elset, elset=_cosim-region_S2, internal, instance=Part-1-1
*Elset, elset=_cosim-region_S4, internal, instance=Part-1-1
*Elset, elset=_cosim-region_S3, internal, instance=Part-1-1
*Elset, elset=_cosim-region_S1, internal, instance=Part-1-1
*Surface, type=ELEMENT, name=cosim-region
_cosim-region_S2, S2
_cosim-region_S4, S4
_cosim-region_S3, S3
_cosim-region_S1, S1
*End Assembly
**
** MATERIALS
**
*Material, name=Material-1
*Density
1.,
*Elastic
100000., 0.1
** ----------------------------------------------------------------
**
** STEP: Step-1
**
*Step, name=Step-1
*Dynamic, Explicit
, 0.5
*Bulk Viscosity
**
** BOUNDARY CONDITIONS
**
** Name: BC-1 Type: Symmetry/Antisymmetry/Encastre
*Boundary
_PickedSet59, ENCASTRE
** Interaction: Int-1
*Co-simulation, name=Int-1, controls=Int-1_Ctrls, program=ABAQUS
*Co-simulation Region, type=SURFACE
cosim-region,
*Co-simulation Controls, name=Int-1_Ctrls, time incrementation=subcycle,
scheme modifier=send
**
** FIELD OUTPUT: F-Output-1
**
*output, field, number interval=1
*node output
U,
**
*End Step