*HEADING
360 DEGREES MODEL CORRESPONDING TO 1X2 MESH OF CPE4R ELEMENTS
Corresponding cyclic symmetry model:cyclicsym_cpe4r_ss.inp
*PREPRINT, ECHO=YES, MODEL=YES, HISTORY=YES
*NODE,NSET=NALL
*ELEMENT, TYPE=CPE4R
*ELSET, ELSET=EALL, GENERATE
*NSET, NSET=NBC
*SOLID SECTION, ELSET=EALL,MATERIAL=MAT
1.,
*MATERIAL,NAME=MAT
*ELASTIC
10E8,0.3
*DENSITY
100,
*SURFACE,NAME=SURF2
*SURFACE,NAME=SURF4
*SURFACE,NAME=SURF6
*SURFACE,NAME=SURF8
*SURFACE,NAME=SURF10
*SURFACE,NAME=SURF12
*SURFACE,NAME=SURF14
*SURFACE,NAME=SURF16
*SURFACE,NAME=SURF18
*SURFACE,NAME=SURF20
*SURFACE,NAME=SURF22
*SURFACE,NAME=SURF24
*BOUNDARY
NBC,1,2
** #1
*STEP,NLGEOM
*STATIC
0.5,1.0
*DLOAD
EALL,cent,3.0e2, 0., 0., 0., 0., 0., 1.
*dsload
SURF2,p,3.0e2
SURF4,p,3.0e2
SURF6,p,3.0e2
SURF8,p,3.0e2
SURF10,p,3.0e2
SURF12,p,3.0e2
SURF14,p,3.0e2
SURF16,p,3.0e2
SURF18,p,3.0e2
SURF20,p,3.0e2
SURF22,p,3.0e2
SURF24,p,3.0e2
*OUTPUT, FIELD, FREQUENCY=2
*NODE OUTPUT,NSET=NALL
U
*ELEMENT OUTPUT
P,
*NODE PRINT
U
*END STEP
** #2
*STEP
*FREQUENCY,EIGENSOLVER=LANCZOS, SIM
21,
*OUTPUT, FIELD, FREQUENCY=0
*END STEP
** #3
*step
*steady state dynamics
100.
*modal damping
*SELECT EIGENMODES, GENERATE
*dload,real
1,cent,6.3e6, 0., 0., 0., 0., 0., 1.
3,cent,5.45596e6, 0., 0., 0., 0., 0., 1.
5,cent,3.15e6, 0., 0., 0., 0., 0., 1.
9,cent,-3.15e6, 0., 0., 0., 0., 0., 1.
11,cent,-5.45596e6, 0., 0., 0., 0., 0., 1.
13,cent,-6.3e6, 0., 0., 0., 0., 0., 1.
15,cent,-5.45596e6, 0., 0., 0., 0., 0., 1.
17,cent,-3.15e6, 0., 0., 0., 0., 0., 1.
21,cent,3.15e6, 0., 0., 0., 0., 0., 1.
23,cent,5.45596e6, 0., 0., 0., 0., 0., 1.
*dload,imaginary
3,cent,-3.15e6, 0., 0., 0., 0., 0., 1.
5,cent,-5.45596e6, 0., 0., 0., 0., 0., 1.
7,cent,-6.3e6, 0., 0., 0., 0., 0., 1.
9,cent,-5.45596e6, 0., 0., 0., 0., 0., 1.
11,cent,-3.15e6, 0., 0., 0., 0., 0., 1.
15,cent,3.15e6, 0., 0., 0., 0., 0., 1.
17,cent,5.45596e6, 0., 0., 0., 0., 0., 1.
19,cent,6.3e6, 0., 0., 0., 0., 0., 1.
21,cent,5.45596e6, 0., 0., 0., 0., 0., 1.
23,cent,3.15e6, 0., 0., 0., 0., 0., 1.
*dload,real
2,cent,6.3e6, 0., 0., 0., 0., 0., 1.
4,cent,5.45596e6, 0., 0., 0., 0., 0., 1.
6,cent,3.15e6, 0., 0., 0., 0., 0., 1.
10,cent,-3.15e6, 0., 0., 0., 0., 0., 1.
12,cent,-5.45596e6, 0., 0., 0., 0., 0., 1.
14,cent,-6.3e6, 0., 0., 0., 0., 0., 1.
16,cent,-5.45596e6, 0., 0., 0., 0., 0., 1.
18,cent,-3.15e6, 0., 0., 0., 0., 0., 1.
22,cent,3.15e6, 0., 0., 0., 0., 0., 1.
24,cent,5.45596e6, 0., 0., 0., 0., 0., 1.
*dload,imaginary
4,cent,-3.15e6, 0., 0., 0., 0., 0., 1.
6,cent,-5.45596e6, 0., 0., 0., 0., 0., 1.
8,cent,-6.3e6, 0., 0., 0., 0., 0., 1.
10,cent,-5.45596e6, 0., 0., 0., 0., 0., 1.
12,cent,-3.15e6, 0., 0., 0., 0., 0., 1.
16,cent,3.15e6, 0., 0., 0., 0., 0., 1.
18,cent,5.45596e6, 0., 0., 0., 0., 0., 1.
20,cent,6.3e6, 0., 0., 0., 0., 0., 1.
22,cent,5.45596e6, 0., 0., 0., 0., 0., 1.
24,cent,3.15e6, 0., 0., 0., 0., 0., 1.
******
*dsload,real
SURF2,p,  6.3e6
SURF4,p,  5.45596e6
SURF6,p,  3.15e6
SURF8,p,  0.0
SURF10,p,-3.15e6
SURF12,p,-5.45596e6
SURF14,p,-6.3e6
SURF16,p,-5.45596e6
SURF18,p,-3.15e6
SURF20,p, 0.0
SURF22,p, 3.15e6
SURF24,p, 5.45596e6
*dsload,imaginary
SURF2,p,  0.0
SURF4,p, -3.15e6
SURF6,p, -5.45596e6
SURF8,p, -6.3e6
SURF10,p,-5.45596e6
SURF12,p,-3.15e6
SURF16,p, 3.15e6
SURF18,p, 5.45596e6
SURF20,p, 6.3e6
SURF22,p, 5.45596e6
SURF24,p, 3.15e6
*modal print
gu
*node print
u
*OUTPUT, FIELD
*NODE OUTPUT,NSET=NALL
U
*end step
** #4
*STEP
*MATRIX GENERATE,STIFFNESS,MASS,LOAD
*dload,real
1,cent,6.3e6, 0., 0., 0., 0., 0., 1.
3,cent,5.45596e6, 0., 0., 0., 0., 0., 1.
5,cent,3.15e6, 0., 0., 0., 0., 0., 1.
9,cent,-3.15e6, 0., 0., 0., 0., 0., 1.
11,cent,-5.45596e6, 0., 0., 0., 0., 0., 1.
13,cent,-6.3e6, 0., 0., 0., 0., 0., 1.
15,cent,-5.45596e6, 0., 0., 0., 0., 0., 1.
17,cent,-3.15e6, 0., 0., 0., 0., 0., 1.
21,cent,3.15e6, 0., 0., 0., 0., 0., 1.
23,cent,5.45596e6, 0., 0., 0., 0., 0., 1.
*dload,imaginary
3,cent,-3.15e6, 0., 0., 0., 0., 0., 1.
5,cent,-5.45596e6, 0., 0., 0., 0., 0., 1.
7,cent,-6.3e6, 0., 0., 0., 0., 0., 1.
9,cent,-5.45596e6, 0., 0., 0., 0., 0., 1.
11,cent,-3.15e6, 0., 0., 0., 0., 0., 1.
15,cent,3.15e6, 0., 0., 0., 0., 0., 1.
17,cent,5.45596e6, 0., 0., 0., 0., 0., 1.
19,cent,6.3e6, 0., 0., 0., 0., 0., 1.
21,cent,5.45596e6, 0., 0., 0., 0., 0., 1.
23,cent,3.15e6, 0., 0., 0., 0., 0., 1.
*dload,real
2,cent,6.3e6, 0., 0., 0., 0., 0., 1.
4,cent,5.45596e6, 0., 0., 0., 0., 0., 1.
6,cent,3.15e6, 0., 0., 0., 0., 0., 1.
10,cent,-3.15e6, 0., 0., 0., 0., 0., 1.
12,cent,-5.45596e6, 0., 0., 0., 0., 0., 1.
14,cent,-6.3e6, 0., 0., 0., 0., 0., 1.
16,cent,-5.45596e6, 0., 0., 0., 0., 0., 1.
18,cent,-3.15e6, 0., 0., 0., 0., 0., 1.
22,cent,3.15e6, 0., 0., 0., 0., 0., 1.
24,cent,5.45596e6, 0., 0., 0., 0., 0., 1.
*dload,imaginary
4,cent,-3.15e6, 0., 0., 0., 0., 0., 1.
6,cent,-5.45596e6, 0., 0., 0., 0., 0., 1.
8,cent,-6.3e6, 0., 0., 0., 0., 0., 1.
10,cent,-5.45596e6, 0., 0., 0., 0., 0., 1.
12,cent,-3.15e6, 0., 0., 0., 0., 0., 1.
16,cent,3.15e6, 0., 0., 0., 0., 0., 1.
18,cent,5.45596e6, 0., 0., 0., 0., 0., 1.
20,cent,6.3e6, 0., 0., 0., 0., 0., 1.
22,cent,5.45596e6, 0., 0., 0., 0., 0., 1.
24,cent,3.15e6, 0., 0., 0., 0., 0., 1.
******
*dsload,real
SURF2,p,  6.3e6
SURF4,p,  5.45596e6
SURF6,p,  3.15e6
SURF8,p,  0.0
SURF10,p,-3.15e6
SURF12,p,-5.45596e6
SURF14,p,-6.3e6
SURF16,p,-5.45596e6
SURF18,p,-3.15e6
SURF20,p, 0.0
SURF22,p, 3.15e6
SURF24,p, 5.45596e6
*dsload,imaginary
SURF2,p,  0.0
SURF4,p, -3.15e6
SURF6,p, -5.45596e6
SURF8,p, -6.3e6
SURF10,p,-5.45596e6
SURF12,p,-3.15e6
SURF16,p, 3.15e6
SURF18,p, 5.45596e6
SURF20,p, 6.3e6
SURF22,p, 5.45596e6
SURF24,p, 3.15e6
*END STEP