*HEADING
TEST OF FLUID ELEMENTS AND FLUID LINK
*Preprint, Contact=Yes, Model=Yes, History=Yes
*NODE,NSET=ALL
**
**
**
*NODE,NSET=FREF
*NGEN,LINE=C,NSET=ALL
*ELEMENT,TYPE=M3D4,ELSET=CAN1
*ELGEN,ELSET=CAN1
*ELEMENT,TYPE=M3D4,ELSET=CAN2
*ELGEN,ELSET=CAN2
*ELEMENT,TYPE=R3D3,ELSET=IMPACTOR
*ELEMENT,TYPE=R3D3,ELSET=END
*BOUNDARY
79991,1
79991,3,6
5001,XSYMM
5019,XSYMM
6001,XSYMM
6019,XSYMM
19991,1,6
17001,XSYMM
17001,3,4
15001,XSYMM
15019,XSYMM
16001,XSYMM
16019,XSYMM
11001,1,6
ALL,3
*ELEMENT,TYPE=F3D4,ELSET=FLU1
*ELGEN,ELSET=FLU1
*ELEMENT,TYPE=F3D3,ELSET=FLU1
*ELEMENT,TYPE=F3D3,ELSET=FLU2
*ELEMENT,TYPE=F3D4,ELSET=FLU2
*ELGEN,ELSET=FLU2
*PHYSICAL CONSTANTS, ABSOLUTE ZERO=-273.16
*FLUID PROPERTY,ELSET=FLU1,AMBIENT=50000.,REF NODE=991
*FLUID DENSITY
800.,
*FLUID PROPERTY,ELSET=FLU2,AMBIENT=50000.,REF NODE =992
*FLUID DENSITY
800.,
*ELEMENT,TYPE=FLINK,ELSET=TUBE
*FLUID LINK,TYPE=FUNCTION,ELSET=TUBE
*ELEMENT,TYPE=MASS,ELSET=MASS
*MASS,ELSET=MASS
1.E-10
*MEMBRANE SECTION,ELSET=CAN1,MATERIAL=ST
0.05,
*MEMBRANE SECTION,ELSET=CAN2,MATERIAL=ST
0.05,
*MATERIAL,NAME=ST
*DENSITY
1000.,
*HYPERELASTIC,TEST DATA INPUT,OGDEN,N=3
*UNIAXIAL TEST DATA
*BIAXIAL TEST DATA
*PLANAR TEST DATA
*MPC
LINEAR,1,5001,5019
LINEAR,10001,15001,15019
LINEAR,2,6001,6019
LINEAR,10002,16001,16019
*INITIAL CONDITIONS,TYPE=FLUID PRESSURE
991, 3254.6765
992, 3254.6765
*INITIAL CONDITIONS,TYPE=STRESS
CAN1,67579.88,31070.0293
CAN2,67579.88,31070.0293
*RESTART,WRITE,NUM=2,TIMEMARKS=NO
*RIGID BODY,ELSET=IMPACTOR,REF NODE=79991
*RIGID BODY,ELSET=END,REF NODE=19991
*************************************************************
**General contact definition
*Contact
*Contact Inclusions, All Element Based
*Surface Property Assignment,Property=Feature Edge Criteria
,NO FEATURE EDGES
*************************************************************
*NSET,NSET=QA_TEST
*STEP
*DYNAMIC,EXPLICIT
,64.0
*BOUNDARY,TYPE=VELOCITY
79991,2,,-.04
*NSET, NSET=RFCHECK
*OUTPUT, FIELD, TIMEMARKS=NO, NUMBER INTERVAL=10
*ELEMENT OUTPUT
S,SP,LE,LEP,ERV
*NODE OUTPUT
U,V,A,RF
*CONTACT OUTPUT
CFORCE
***OUTPUT,HISTORY,TIME INTERVAL=0.064
*OUTPUT,HISTORY,FREQ=1
*ENERGY OUTPUT,VARIABLE=ALL
*NODE OUTPUT,NSET=FREF
PCAV,CVOL
*NODE OUTPUT,NSET=QA_TEST
RF2,
**
** Output requests for qa testing
**
*OUTPUT,FIELD,NUM=1
*NODE OUTPUT,NSET=QA_TEST
RF,
*END STEP