*HEADING
RATE DEPENDENCY, NOMINAL STRAIN RATE = 200.
*NODE, NSET=QA_TEST_ALLNODES
**
*NODE,NSET=FIX3
*NODE, NSET=QA_TEST_ALLNODES
**
**
**
*NODE,NSET=FIX3
**
*NODE, NSET=QA_TEST_ALLNODES
**
**
*NSET,NSET=BOT
*NSET,NSET=TOP
*ELEMENT,TYPE=C3D8R
*ELEMENT,TYPE=CPE4R
*ELEMENT,TYPE=CPS4R
*ELSET,ELSET=NORATE
*ELSET,ELSET=RATEDEP
*SOLID SECTION,ELSET=NORATE,MATERIAL=NORATE
*SOLID SECTION,ELSET=RATEDEP,MATERIAL=RATEDEP
*MATERIAL,NAME=NORATE
*DENSITY
1500.,
*ELASTIC
2.E9,0.4
*PLASTIC
60.E6,0.0
1.E8,3.0
*MATERIAL,NAME=RATEDEP
*DENSITY
1500.,
*ELASTIC
2.E9,0.4
*PLASTIC
60.E6,0.0
1.E8,2.0
*RATE DEPENDENT
*BOUNDARY
FIX3,3,3
*AMPLITUDE,NAME=RAMP
0.0,0.0,0.01,1.0
**
**
*ELSET,ELSET=QA_TEST_ALLELEMS
NORATE, RATEDEP
**
*NSET, NSET=QA_TEST_ALLNODES
QA_TEST_ALLNODES, FIX3, FIX3, BOT
TOP,
**
*STEP
*DYNAMIC,EXPLICIT
,0.01
*BOUNDARY,TYPE=VELOCITY,AMPLITUDE=RAMP
 TOP,2,, 100.
 BOT,2,,-100.
**
*FILE OUTPUT,NUMBER INTERVAL=2,TIME MARKS=YES
*EL FILE
 MISES,PEEQ,PE,
 ELEN,
*NODE FILE
 U,
**
*OUTPUT, FIELD, NUMBER INTERVAL=2, TIMEMARKS=YES
*ELEMENT OUTPUT, ELSET=QA_TEST_ALLELEMS
 MISES,PEEQ,PE,
 ELEN,
*NODE OUTPUT, NSET=QA_TEST_ALLNODES
 U,
*OUTPUT,FIELD,VARIABLE=PRESELECT
*OUTPUT,HISTORY,VARIABLE=PRESELECT,TIMEINT=0.005
***OUTPUT,HISTORY,VARIABLE=PRESELECT
*END STEP