*HEADING
 TEST OF NONLINEAR USER ELEMENTS
*NODE,NSET=PR
*NGEN,NSET=N1
*ELEMENT,TYPE=T3D2
*ELGEN,ELSET=TRUSS
*SOLID SECTION,ELSET=TRUSS,MATERIAL=S1
0.002,
*MATERIAL,NAME=S1
*ELASTIC
2.1E11,0.3
*DENSITY
7200.,
*NODE,NSET=PR
*NGEN,NSET=N2
*USER ELEMENT,NODES=2,TYPE=U1001,PROPERTIES=4,COORDINATES=3,VARIABLES=6
*ELEMENT,TYPE=U1001
*ELGEN,ELSET=UTRUSS
*UEL PROPERTY,ELSET=UTRUSS
*BOUNDARY
N1,2,3
N2,2,3
**
*STEP,PERTURBATION
*STATIC
*BOUNDARY
1,1
101,1
*CLOAD
  6, 1, 5.
106, 1, 5.
*END STEP
**
*STEP,PERTURBATION
Frequency extraction for truss elements only
*FREQUENCY, eigensolver=lanczos, sim
6, ,
*BOUNDARY
N2,1
*END STEP
**
*STEP,PERTURBATION
Frequency extraction for user elements only
*FREQUENCY, eigensolver=lanczos, sim
6, ,
*BOUNDARY
N1,1
*END STEP
*STEP,PERTURBATION
COMPLEX FREQUENCY EXTRACTION FOR USER ELEMENTS ONLY
*COMPLEX FREQUENCY
*END STEP
**
*STEP,PERTURBATION
*STEADYSTATEDYN, DIRECT
*CLOAD
101, 1, 1.E9
*NODE PRINT, NSET=N2
U1,
*Output, hist
*Node output, NSET=N2
U1,
*END STEP
**
*STEP,PERTURBATION
*STEADYSTATEDYN, SUBSPACE PROJECTION
*CLOAD
101, 1, 1.E9
*END STEP
**
*STEP,PERTURBATION
*MATRIX GENERATE, STIFFNESS, MASS
*END STEP