*Heading
 Fluid filled bottle drop using CEL
** Job name: Bottle-drop Model name: Bottle drop
*Preprint, echo=NO, model=NO, history=NO, contact=NO
**
** PARTS
**
*Part, name=Bottle
*Node
*Element, type=S4R
*Element, type=S3R
*Elset, elset=Top, generate
*Nset, nset=All, generate
*Elset, elset=All, generate
*Elset, elset=Bot
*Elset, elset=_Surf_, internal, generate
*Surface, type=ELEMENT, name=Surf
_Surf_,
** Section: Bottle-thin
*Shell Section, elset=Bot, material=HDPE, offset=SNEG
0.5, 3
** Section: Bottle-thick
*Shell Section, elset=Top, material=HDPE, offset=SNEG
0.65, 3
*End Part
**
*Part, name=Cap
*Node
*Element, type=S4R
*Nset, nset=All, generate
*Elset, elset=All, generate
*Elset, elset=_Surf_, internal, generate
*Surface, type=ELEMENT, name=Surf
_Surf_,
** Section: Cap
*Shell Section, elset=All, material=HDPE, offset=SNEG
1., 3
*End Part
**
*Part, name=Eulerian
*Node
*Element, type=EC3D8R
*Nset, nset=All, generate
*Elset, elset=All, generate
** Section: Eulerian
*Eulerian Section, elset=All
Fluid, Fluid-1
*Surface, type=EULERIAN MATERIAL, name=Fluid-1
Fluid-1
*End Part
**
*Part, name=Floor
*Node
*Element, type=SFM3D4R
*Nset, nset=All, generate
*Elset, elset=All, generate
*Elset, elset=_Surf_SPOS, internal, generate
*Surface, type=ELEMENT, name=Surf
_Surf_SPOS, SPOS
** Section: Floor
*Surface Section, elset=All
*End Part
**
**
** ASSEMBLY
**
*Assembly, name=Assembly
**
*Instance, name=Floor, part=Floor
*End Instance
**
*Instance, name=Bottle, part=Bottle
*End Instance
**
*Instance, name=Cap, part=Cap
*End Instance
**
*Instance, name=Eulerian, part=Eulerian
*End Instance
**
*Node
*Nset, nset="Floor ref pt"
** Constraint: Rigid floor
*Rigid Body, ref node="Floor ref pt", elset=Floor.All
*End Assembly
**
** MATERIALS
**
** Fluid
*Material, name=Fluid
*Density
 9.96e-07,
*Eos, type=USUP
*Viscosity
** High density polyethelyne
*Material, name=HDPE
*Damage Initiation, criterion=DUCTILE
 0.59,0.,0.
*Damage Evolution, type=DISPLACEMENT
0.,
*Density
 8.76e-07,
*Elastic
903114., 0.39
*Plastic
 8618.,    0.
13064., 0.007
16787., 0.025
18476., 0.044
20337., 0.081
24543.,  0.28
26887.,  0.59
**
** INTERACTION PROPERTIES
**
*Surface Interaction, name=Default
**
** BOUNDARY CONDITIONS
**
** Name: Fix floor Type: Displacement/Rotation
*Boundary
"Floor ref pt", 1, 1
"Floor ref pt", 2, 2
"Floor ref pt", 3, 3
"Floor ref pt", 4, 4
"Floor ref pt", 5, 5
"Floor ref pt", 6, 6
**
** PREDEFINED FIELDS
**
** Name: Bottle initial velocity   Type: Velocity
*Initial Conditions, type=VELOCITY
Bottle.All, 1, 0.
Bottle.All, 2, 0.
Bottle.All, 3, -2444.
** Name: Cap initial velocity   Type: Velocity
*Initial Conditions, type=VELOCITY
Cap.All, 1, 0.
Cap.All, 2, 0.
Cap.All, 3, -2444.
** Name: Fluid initial velocity   Type: Velocity
*Initial Conditions, type=VELOCITY
Eulerian.All, 1, 0.
Eulerian.All, 2, 0.
Eulerian.All, 3, -2444.
** Name: Fluid material assignment   Type: Material assignment
*Initial Conditions, type=VOLUME FRACTION
Eulerian.21335, Eulerian.Fluid-1, 0.00866699
Eulerian.21336, Eulerian.Fluid-1, 0.0637207
Eulerian.21337, Eulerian.Fluid-1, 0.0465088
Eulerian.21338, Eulerian.Fluid-1, 0.00146484
Eulerian.21339, Eulerian.Fluid-1, 0.0012207
Eulerian.21340, Eulerian.Fluid-1, 0.000366211
Eulerian.21374, Eulerian.Fluid-1, 0.000976563
Eulerian.21375, Eulerian.Fluid-1, 0.263794
Eulerian.21376, Eulerian.Fluid-1, 0.430054
Eulerian.21377, Eulerian.Fluid-1, 0.379395
Eulerian.21378, Eulerian.Fluid-1, 0.324097
Eulerian.21379, Eulerian.Fluid-1, 0.252197
Eulerian.21380, Eulerian.Fluid-1, 0.169067
Eulerian.21381, Eulerian.Fluid-1, 0.121338
Eulerian.21382, Eulerian.Fluid-1, 0.0692139
Eulerian.21383, Eulerian.Fluid-1, 0.0250244
Eulerian.21384, Eulerian.Fluid-1, 0.000610352
Eulerian.21414, Eulerian.Fluid-1, 0.184204
Eulerian.21415, Eulerian.Fluid-1, 0.703491
Eulerian.21416, Eulerian.Fluid-1, 0.812988
** ... 12276 like lines cut
** ----------------------------------------------------------------
**
** STEP: Step-1
**
*Step, name=Step-1
Drop from 305 mm
*Dynamic, Explicit
, 0.05
*Bulk Viscosity
** Mass Scaling: Semi-Automatic
**               Bottle.All
*Fixed Mass Scaling, elset=Bottle.All, dt=7.528e-07, type=below min
**
** LOADS
**
** Name: Gravity on bottle   Type: Gravity
*Dload
Bottle.All, GRAV, 9800., 0., 0., -1.
** Name: Gravity on cap   Type: Gravity
*Dload
Cap.All, GRAV, 9800., 0., 0., -1.
** Name: Gravity on fluid   Type: Gravity
*Dload
Eulerian.All, GRAV, 9800., 0., 0., -1.
**
** INTERACTIONS
**
** Interaction: General contact
*Contact, op=NEW
*Contact Inclusions, ALL EXTERIOR
*Contact property assignment
 ,  , Default
**
** OUTPUT REQUESTS
**
*Restart, write, number interval=1, time marks=NO
**
** FIELD OUTPUT: Bottle U,V, strain, damage, status
**
*Output, field, number interval=50
*Node Output, nset=Bottle.All
UT, VT
*Element Output, elset=Bottle.All, directions=YES
DMICRT, LE, PEEQ, STATUS
**
** FIELD OUTPUT: Cap U, V, strain, damage, status
**
*Node Output, nset=Cap.All
UT, VT
*Element Output, elset=Cap.All, directions=YES
DMICRT, LE, PEEQ, STATUS
**
** FIELD OUTPUT: Fluid volume fraction and stress
**
*Element Output, elset=Eulerian.All, directions=YES
EVF, SVAVG
**
** HISTORY OUTPUT: Whole model energy
**
*Output, history, frequency=1
*Energy Output
ALLAE, ALLCW, ALLDMD, ALLFD, ALLIE, ALLKE, ALLMW, ALLPD, ALLPW, ALLSE, ALLWK, ETOTAL
**
** HISTORY OUTPUT: Floor reaction forces
**
*Node Output, nset="Floor ref pt"
RF1, RF2, RF3
*End Step