*Heading
Standard-to-Explicit co-simulation with dissimilar meshes.
Standard mesh is coarser than the Explicit mesh.
*Preprint, echo=NO, model=NO, history=NO, contact=NO
**
** PARTS
**
*Part, name=Part-1
*End Part
**
**
** ASSEMBLY
**
*Assembly, name=Assembly
**
*Instance, name=Part-1-2, part=Part-1
*Node
*Element, type=C3D4
*Nset, nset=_PickedSet22, internal, generate
*Elset, elset=_PickedSet22, internal, generate
** Section: Section-1
*Solid Section, elset=_PickedSet22, material=Material-1
*End Instance
**
*Nset, nset=_PickedSet38, internal, instance=Part-1-2
*Elset, elset=_PickedSet38, internal, instance=Part-1-2
*Nset, nset=load-set, instance=Part-1-2
*Elset, elset=__PickedSurf39_S3, internal, instance=Part-1-2
*Elset, elset=__PickedSurf39_S1, internal, instance=Part-1-2
*Elset, elset=__PickedSurf39_S4, internal, instance=Part-1-2
*Elset, elset=__PickedSurf39_S2, internal, instance=Part-1-2
*Surface, type=ELEMENT, name=_PickedSurf39, internal
__PickedSurf39_S3, S3
__PickedSurf39_S1, S1
__PickedSurf39_S4, S4
__PickedSurf39_S2, S2
*Elset, elset=_cosim-region_S3, internal, instance=Part-1-2
*Elset, elset=_cosim-region_S1, internal, instance=Part-1-2
*Elset, elset=_cosim-region_S4, internal, instance=Part-1-2
*Elset, elset=_cosim-region_S2, internal, instance=Part-1-2
*Surface, type=ELEMENT, name=cosim-region
_cosim-region_S3, S3
_cosim-region_S1, S1
_cosim-region_S4, S4
_cosim-region_S2, S2
*End Assembly
*Amplitude, name=Amp-1
          0.,           0.,          0.2,           1.,          0.3,           0.,           5.,           0.
**
** MATERIALS
**
*Material, name=Material-1
*density
10.,
*elastic
1000000000., 0.1
*amplitude, name=ramp1
0.,0.0,  1.0, 1.0,
** ----------------------------------------------------------------
**
** STEP: Step-1
**
*Step, name=Step-1
*Dynamic, Explicit
,0.3
**, 1.0
*Bulk Viscosity
**
** LOADS
**
** Name: Load-1   Type: Concentrated force
*Cload, amplitude=ramp1
load-set, 2, -2000.
** Interaction: Int-1
*Co-simulation, name=Int-1, controls=Int-1_Ctrls, program=ABAQUS
*Co-simulation Region, type=SURFACE
cosim-region,
*Co-simulation Controls, name=Int-1_Ctrls, time incrementation=subcycle
**
** OUTPUT REQUESTS
**
**
*Output, field, number interval=1
*node output
U,
*End Step