*Heading
** Job name: crack_modeII_xfem_c3d4_c Model name: Model-1
** Generated by: Abaqus/CAE Version 6.9-DEV
*Preprint, echo=NO, model=yes, history=NO, contact=NO
*Node
*Element, type=C3D4
*Nset, nset=_PickedSet2
**Nset, nset=_PickedSet2, generate
**    1,  1508,     1
*Elset, elset=_PickedSet2, generate
** Section: Section-1
*Solid Section, elset=_PickedSet2, material=Material-1
**
*enrichment,elset=_PickedSet2,interaction=lower,type=propagation crack,name=abc
**
*Nset, nset=_PickedSet10
*Elset, elset=_PickedSet10
*Nset, nset=_PickedSet11
*Elset, elset=_PickedSet11
**
** MATERIALS
**
*Material, name=Material-1
*Elastic
 2.1e+11, 0.3
*DAMAGE INITIATION,CRITERION=MAXPS,tolerance=0.1
8.44E7
*DAMAGE EVOLUTION,TYPE=ENERGY,MIXED MODE BEHAVIOR=POWER LAW,POWER=1.0
4.22d4,4.22d4
*DAMAGE STABILIZATION
*surface interaction,name=lower
**
*initial condition,type=enrichment
     1, 1,abc,  -0.0500000,  -1.5000000
     1, 2,abc,  -0.0500000,  -1.5000000
     1, 3,abc,   0.0500000,  -1.5000000
     1, 4,abc,   0.0500000,  -1.0000000
     2, 1,abc,   0.0500000,  -1.0000000
     2, 2,abc,  -0.0500000,  -1.5000000
     2, 3,abc,   0.0500000,  -1.5000000
     2, 4,abc,   0.0003915,  -1.1185064
     3, 1,abc,   0.0003915,  -1.1185064
     3, 2,abc,  -0.0500000,  -1.0000000
     3, 3,abc,   0.0500000,  -1.0000000
     3, 4,abc,  -0.0500000,  -1.5000000
     4, 1,abc,   0.0003915,  -1.1185064
     4, 2,abc,  -0.0500000,  -1.5000000
     4, 3,abc,  -0.0500000,  -1.5000000
     4, 4,abc,  -0.0500000,  -1.0000000
     5, 1,abc,   0.0003915,  -1.1185064
     5, 2,abc,   0.0500000,  -1.5000000
     5, 3,abc,   0.0500000,  -1.5000000
     5, 4,abc,  -0.0500000,  -1.5000000
** ... 248 like lines cut
**
*Boundary
_PickedSet2,3
**
*nset,nset=disp
*equation
_PickedSet11,1,1,9999,1,-1
** ----------------------------------------------------------------
**
** STEP: Step-1
**
*Step, name=Step-1, nlgeom=YES, inc=1000
*Static
0.1, 1., 1e-09, 0.1
*CONTROLS,PARAMETERS=TIME INCREMENTATION
 , , , , , , ,20
**
** BOUNDARY CONDITIONS
**
** Name: BC-1 Type: Displacement/Rotation
*Boundary
_PickedSet10, 1, 1, -0.0031
_PickedSet10, 2, 2, 0.0
** Name: BC-2 Type: Displacement/Rotation
*Boundary
disp, 1, 1,0.0031
_PickedSet11, 2, 2, 0.0
**
** OUTPUT REQUESTS
**
**
** FIELD OUTPUT: F-Output-1
**
*Output, field
*element output
S
**,STATUSXFEM
*node output
U,philsm
**
** HISTORY OUTPUT: H-Output-1
**
*Output, history
*node output,nset=disp
rf1,u1
*End Step