*HEADING
VERIFICATION OF ELEMENTS LOADED WITH UNIFORM PRESSURE LOAD. (*DLOAD)
ANALYTICAL RESULTS:
	CPE4R	- 400000
	CPS4R	- 400000
	C3D8R	- 400000
	CPE3	- 400000
	CPS3	- 400000
	C3D4	- 400000
	C3D6	- 400000
	S4R	- 400000
	S3R	- 400000
	M3D4R	- 400000
	M3D3	- 400000
	SFM3D4R	- 400000
	SFM3D3	- 400000
	CAX3	- 28900000
	CAX4R	- 28900000
	SAX1	- 31420000
	B21	- 200000
	B31	- 200000
	R2D2	- 200000
	RAX2	- 32670000
	R3D3	- 400000
	R3D4	- 400000
*NODE,NSET=B21
*NODE,NSET=B31
*NODE,NSET=SAX1
*NODE,NSET=C3D8R
*NODE,NSET=CPE4R
*NODE,NSET=CPS4R
*NODE,NSET=CAX4R
*NODE,NSET=S4R
*NODE,NSET=M3D4R
*NODE,nset=sfm3d4r
*NODE,NSET=R2D2
*NODE,NSET=RAX2
*NODE,NSET=R3D3
*NODE,NSET=R3D4
*NODE,NSET=REFNODES
*NODE,NSET=CPE3
*NODE,NSET=CPS3
*NODE,NSET=C3D4
*NODE,NSET=C3D6
*NODE,NSET=CAX3
*NODE,NSET=S3R
*NODE,NSET=M3D3
*node,nset=sfm3d3
*NODE,NSET=CPS6M
*NODE,NSET=CPE6M
*NODE,NSET=CAX6M
*NODE,NSET=C3D10M
**
*ELEMENT,TYPE=B21,ELSET=B21
*ELEMENT,TYPE=B31,ELSET=B31
*ELEMENT,TYPE=CPE4R,ELSET=CPE4R
*ELEMENT,TYPE=CPS4R,ELSET=CPS4R
*ELEMENT,TYPE=CAX4R,ELSET=CAX4R
*ELEMENT,TYPE=C3D8R,ELSET=C3D8R
*ELEMENT,TYPE=S4R,ELSET=S4R
*ELEMENT,TYPE=SAX1,ELSET=SAX1
*ELEMENT,TYPE=M3D4R,ELSET=M3D4R
*ELEMENT, TYPE=SFM3D4R, ELSET=SFM3D4R
*ELEMENT,TYPE=CPE3,ELSET=CPE3
*ELEMENT,TYPE=CAX3,ELSET=CAX3
*ELEMENT,TYPE=CPS3,ELSET=CPS3
*ELEMENT,TYPE=C3D4,ELSET=C3D4
*ELEMENT,TYPE=C3D6,ELSET=C3D6
*ELEMENT,TYPE=M3D3,ELSET=M3D3
*ELEMENT,TYPE=SFM3D3,ELSET=SFM3D3
*ELEMENT,TYPE=S3R,ELSET=S3R
*ELEMENT,TYPE=R2D2,ELSET=R2D2
*ELEMENT,TYPE=RAX2,ELSET=RAX2
*ELEMENT,TYPE=R3D3,ELSET=R3D3
*ELEMENT,TYPE=R3D4,ELSET=R3D4
*ELEMENT,TYPE=CPS6M,ELSET=CPS6M
*ELEMENT,TYPE=CPS6M,ELSET=CPE6M
*ELEMENT,TYPE=CAX6M,ELSET=CAX6M
*ELEMENT,TYPE=C3D10M,ELSET=C3D10M
**
*BEAM SECTION,SECTION=RECT,ELSET=B21,MATERIAL=A1ELAS
0.2,0.2
*BEAM SECTION,SECTION=RECT,ELSET=B31,MATERIAL=A1ELAS
0.2,0.2
*SOLID SECTION,ELSET=C3D8R,MATERIAL=A1ELAS
*SOLID SECTION,ELSET=CPE4R,MATERIAL=A1ELAS
2.0,
*SOLID SECTION,ELSET=CPS4R,MATERIAL=A1ELAS
2.0,
*SHELL SECTION,ELSET=S4R,MATERIAL=A1ELAS
0.2,3
*SHELL SECTION,ELSET=SAX1,MATERIAL=A1ELAS
0.02,3
*SHELL SECTION,ELSET=S3R,MATERIAL=A1ELAS
0.2,3
*SOLID SECTION,ELSET=CAX4R,MATERIAL=A1ELAS
*SOLID SECTION,ELSET=CAX3,MATERIAL=A1ELAS
*SOLID SECTION,ELSET=C3D4,MATERIAL=A1ELAS
*SOLID SECTION,ELSET=C3D6,MATERIAL=A1ELAS
*SOLID SECTION,ELSET=CPE3,MATERIAL=A1ELAS
2.0,
*SOLID SECTION,ELSET=CPS3,MATERIAL=A1ELAS
2.0,
*MEMBRANE SECTION,ELSET=M3D4R,MATERIAL=A1ELAS
0.2,
*MEMBRANE SECTION,ELSET=M3D3,MATERIAL=A1ELAS
0.2,
*SURFACE SECTION, ELSET=sfm3d4r, DENSITY = 157
*SURFACE SECTION, ELSET=sfm3d3, DENSITY = 157
*RIGID BODY,ELSET=R2D2,REF NODE=10613
*RIGID BODY,ELSET=RAX2,REF NODE=10614
*RIGID BODY,ELSET=R3D3,REF NODE=10615
*RIGID BODY,ELSET=R3D4,REF NODE=10616
*SOLID SECTION,ELSET=CPS6M,MATERIAL=A1ELAS
2.0
*SOLID SECTION,ELSET=CPE6M,MATERIAL=A1ELAS
2.0
*SOLID SECTION,ELSET=CAX6M,MATERIAL=A1ELAS
*SOLID SECTION,ELSET=C3D10M,MATERIAL=A1ELAS
**
*MATERIAL,NAME=A1ELAS
*ELASTIC
193.1E9,0.3
*DENSITY
785,
**
*ELSET,ELSET=EALL
B21,B31,
C3D8R,C3D4,C3D6,C3D10M,
CPE4R,CPS4R,CAX4R,
CPE3,CPS3,CAX3,
CPS6M,CPE6M,CAX6M,
S4R,S3R,SAX1,
M3D4R,M3D3,SFM3D4R,SFM3D3,
R3D4,R3D3,R2D2,RAX2
*ELSET,ELSET=PX
B21,B31,
*ELSET,ELSET=PY
B21,B31,
*ELSET,ELSET=PZ
B31,
*ELSET,ELSET=P
S4R,S3R,SAX1,
M3D4R,M3D3,SFM3D4R,SFM3D3,
R3D4,R3D3,R2D2,RAX2
*ELSET,ELSET=P1
C3D8R,C3D4,C3D6,C3D10M,
CPE4R,CPS4R,CAX4R,
CPE3,CPS3,CAX3,
CPS6M,CPE6M,CAX6M,
*ELSET,ELSET=P2
C3D8R,C3D4,C3D6,C3D10M,
CPE4R,CPS4R,CAX4R,
CPE3,CPS3,CAX3,
CPS6M,CPE6M,CAX6M,
*ELSET,ELSET=P3
C3D8R,C3D4,C3D6,C3D10M,
CPE4R,CPS4R,CAX4R,
CPE3,CPS3,CAX3,
CPS6M,CPE6M,CAX6M,
*ELSET,ELSET=P4
C3D8R,C3D4,C3D6,C3D10M,
CPE4R,CPS4R,CAX4R,
*ELSET,ELSET=P5
C3D8R,C3D6,
*ELSET,ELSET=P6
C3D8R,
**
*NSET,NSET=FIX2D
B21,
CPE4R,CPS4R,CAX4R,
CPE3,CPS3,CAX3,
CPS6M,CPE6M,CAX6M,
SAX1,
*NSET,NSET=FIX3D
B31,
C3D8R,C3D4,C3D6,C3D10M,
S4R,S3R,
M3D4R,M3D3,SFM3D4R,SFM3D3,
*NSET,NSET=RIGID
R3D4,R3D3,R2D2,RAX2
*NSET,NSET=NALL
FIX2D,FIX3D,RIGID,REFNODES
**
*BOUNDARY
FIX2D,1,2
FIX3D,1,3
REFNODES,1,6
**
*RESTART,WRITE,NUMBER=1
*AMPLITUDE,NAME=RAMP
0.,0.,0.0005,1.0,0.001,1.0
**
*NSET, NSET=QA_TEST_ALLNODES
B21, B31, SAX1, C3D8R
CPE4R, CPS4R, CAX4R, S4R
M3D4R, R2D2, RAX2, R3D3
R3D4, REFNODES, CPE3, CPS3
C3D4, C3D6, CAX3, S3R
M3D3, CPS6M, CPE6M, CAX6M
C3D10M, FIX2D, FIX3D, RIGID
NALL, SFM3D4R,SFM3D3
**
*STEP
*DYNAMIC,EXPLICIT
,0.001
*DLOAD,AMP=RAMP
P,  P,100000.
PX,PX,100000.
P1,P1,100000.
*FILE OUTPUT,NUM=1, TIMEMARKS=YES
*NODE FILE
RF,
***OUTPUT,HISTORY,TIME INTERVAL=0.0
***NODE OUTPUT,NSET=NALL
**RF,
*OUTPUT, FIELD, NUMBER INTERVAL=1, TIMEMARKS=YES
*NODE OUTPUT, NSET=QA_TEST_ALLNODES
RF,
*OUTPUT,FIELD,VARIABLE=PRESELECT
*OUTPUT,HISTORY,VARIABLE=PRESELECT,TIMEINT=0.001
*END STEP
*STEP
*DYNAMIC,EXPLICIT
,0.001
*DLOAD,AMP=RAMP,OP=NEW
PY,PY,100000.
P2,P2,100000.
*FILE OUTPUT,NUM=1, TIMEMARKS=YES
*NODE FILE
RF,
*OUTPUT, FIELD, NUMBER INTERVAL=1, TIMEMARKS=YES
*NODE OUTPUT, NSET=QA_TEST_ALLNODES
RF,
*OUTPUT,FIELD,VARIABLE=PRESELECT
*OUTPUT,HISTORY,VARIABLE=PRESELECT,TIMEINT=0.001
*END STEP
*STEP
*DYNAMIC,EXPLICIT
,0.001
*DLOAD,AMP=RAMP,OP=NEW
PZ,PZ,100000.
P3,P3,100000.
*FILE OUTPUT,NUM=1, TIMEMARKS=YES
*NODE FILE
RF,
*OUTPUT, FIELD, NUMBER INTERVAL=1, TIMEMARKS=YES
*NODE OUTPUT, NSET=QA_TEST_ALLNODES
RF,
*OUTPUT,FIELD,VARIABLE=PRESELECT
*OUTPUT,HISTORY,VARIABLE=PRESELECT,TIMEINT=0.001
*END STEP
*STEP
*DYNAMIC,EXPLICIT
,0.001
*DLOAD,AMP=RAMP,OP=NEW
P4,P4,100000.
*FILE OUTPUT,NUM=1, TIMEMARKS=YES
*NODE FILE
RF,
*OUTPUT, FIELD, NUMBER INTERVAL=1, TIMEMARKS=YES
*NODE OUTPUT, NSET=QA_TEST_ALLNODES
RF,
*OUTPUT,FIELD,VARIABLE=PRESELECT
*OUTPUT,HISTORY,VARIABLE=PRESELECT,TIMEINT=0.001
*END STEP
*STEP
*DYNAMIC,EXPLICIT
,0.001
*DLOAD,AMP=RAMP,OP=NEW
P5,P5,100000.
*FILE OUTPUT,NUM=1, TIMEMARKS=YES
*NODE FILE
RF,
*OUTPUT, FIELD, NUMBER INTERVAL=1, TIMEMARKS=YES
*NODE OUTPUT, NSET=QA_TEST_ALLNODES
RF,
*OUTPUT,FIELD,VARIABLE=PRESELECT
*OUTPUT,HISTORY,VARIABLE=PRESELECT,TIMEINT=0.001
*END STEP
*STEP
*DYNAMIC,EXPLICIT
,0.001
*DLOAD,AMP=RAMP,OP=NEW
P6,P6,100000.
*FILE OUTPUT,NUM=1, TIMEMARKS=YES
*NODE FILE
RF,
*OUTPUT, FIELD, NUMBER INTERVAL=1, TIMEMARKS=YES
*NODE OUTPUT, NSET=QA_TEST_ALLNODES
RF,
*OUTPUT,FIELD,VARIABLE=PRESELECT
*OUTPUT,HISTORY,VARIABLE=PRESELECT,TIMEINT=0.001
*END STEP