*Heading
Std-Xpl co-simulation with TIE at the interface
*Preprint, echo=NO, model=NO, history=NO, contact=NO
**
** PARTS
**
*Part, name=Part-1
*End Part
**
**
** ASSEMBLY
**
*Assembly, name=Assembly
**
*Instance, name=Part-1-2, part=Part-1
*Node
*Element, type=C3D8
*Nset, nset=_PickedSet22, internal, generate
*Elset, elset=_PickedSet22, internal, generate
** Section: Section-1
*Solid Section, elset=_PickedSet22, material=Material-1
*End Instance
**
*Nset, nset=_PickedSet38, internal, instance=Part-1-2
*Elset, elset=_PickedSet38, internal, instance=Part-1-2
*Nset, nset=_PickedSet40, internal, instance=Part-1-2
*Elset, elset=__PickedSurf39_S3, internal, instance=Part-1-2
*Surface, type=ELEMENT, name=_PickedSurf39, internal
__PickedSurf39_S3, S3
*Surface, type=NODE,name=node_surface
_pickedSet38
*End Assembly
*Amplitude, name=Amp-1
          0.,           0.,          0.2,           1.,          0.3,           0.,           5.,           0.
**
** MATERIALS
**
*Material, name=Material-1
*Density
1.,
*Elastic
100000., 0.1
** ----------------------------------------------------------------
**
** STEP: Step-1
**
*Step, name=Step-1
*Dynamic, Explicit
, 0.3
*Bulk Viscosity
**
** LOADS
**
** Name: Load-1   Type: Concentrated force
*Cload, amplitude=Amp-1
_PickedSet40, 2, -200.
** Interaction: Int-1
*Co-simulation, name=Int-1, controls=Int-1_Ctrls, program=ABAQUS
*Co-simulation Region, type=SURFACE
**_PickedSurf39,
node_surface
*Co-simulation Controls, name=Int-1_Ctrls, time incrementation=lockstep
**
** OUTPUT REQUESTS
**
*Restart, write, number interval=1, time marks=NO
**
** FIELD OUTPUT: F-Output-1
**
*Output, field, number interval=1
*node output
U,
**
** HISTORY OUTPUT: H-Output-1
**
*Output, history, variable=PRESELECT, frequency=10
*End Step